siglum,marginalia,folio,sequence,incipit,feast,office,genre,position,cantus_id,mode,finalis,differentia,differentia_new,fulltext_standardized,fulltext_ms,volpiano,image_link,melody_id,cao_concordances,addendum,extra,node_id
"P-BRs Nº32",,001r,1,"Missus est*","Dom. 1 Adventus",V,R,,007170,*,,,,,,,,,GBEMVHRDFSL,,,185092
"P-BRs Nº32",,001r,2,"Dabit ei dominus*","Dom. 1 Adventus",V,V,01,007170b,*,,,,,,,,,"G       FS",,,185093
"P-BRs Nº32",,001r,3,"Conditor alme*","Dom. 1 Adventus",V,H,,008284,*,,,,,,,,,"B       SL",,,185094
"P-BRs Nº32",,001r,4,"Rorate caeli desuper et nubes","Dom. 1 Adventus",V,W,,008188,*,,,,"Rorate caeli desuper et nubes pluant justum R. Aperiatur terra et germinet salvatorem",,,,,"CGBEMVHR FSL",,,185095
"P-BRs Nº32",,001r,5,"Ecce nomen domini venit de","Dom. 1 Adventus",V,A,M,002527,1,,F,,"Ecce nomen domini venit de longinquo et claritas ejus replet orbem terrarum",,,,,"CGBEMVHR FS",,,185096
"P-BRs Nº32",,001r,6,"Miserere mihi domine et","Dom. 1 Adventus",C,A,,203130,6,,G,,"Miserere mihi domine et exaudi orationem meam",,,,,,,,185097
"P-BRs Nº32",,001r,7,"Salva nos domine vigilantes","Dom. 1 Adventus",C,A,N,204361,8,,G,,"Salva nos domine vigilantes custodi nos dormientes ut vigilemus cum Christo et requiescamus in pace",,,,,,,,185098
"P-BRs Nº32",,001v,1,"Ecce venit rex occurramus","Dom. 1 Adventus",M,I,,001074,4,,NE,,"Ecce venit rex occurramus obviam salvatori nostro",,,,,CGBEMVHRDFS,,,185099
"P-BRs Nº32",,001v,2,"Cantate domino canticum novum","Dom. 1 Adventus",M,A,1.,001763,7,,H,,"Cantate domino canticum novum laus ejus ab extremis terrae",,,,,"CGBEMVHRDF L",,,185100
"P-BRs Nº32",,001v,3,"Ex Sion species decoris ejus","Dom. 1 Adventus",M,W,1.,008060,*,,,,"Ex Sion species decoris ejus R. Deus noster manifeste veniet",,,,,"C BE VHRDFS",,,185101
"P-BRs Nº32",,001v,4,"Aspiciens a longe ecce video","Dom. 1 Adventus",M,R,1.1,006129,7,,,,"Aspiciens a longe ecce video dei potentiam venientem et nebulam totam terram tegentem ite obviam ei et dicite nuntia nobis si tu es ipse qui regnaturus es in populo Israel",,,,,GBEMVHRDFS,,,185102
"P-BRs Nº32",,002r,1,"Quique terrigenae et filii","Dom. 1 Adventus",M,V,01,006129a,7,,,,"Quique terrigenae et filii hominum simul in unum dives et pauper",,,,,GBEMVHRDFS,,,185103
"P-BRs Nº32",,002r,2,"Qui regis Israel intende qui","Dom. 1 Adventus",M,V,02,006129b,7,,,,"Qui regis Israel intende qui deducis velut ovem Joseph",,,,,GBEMVHRDF,,,185104
"P-BRs Nº32",,002r,3,"Excita domine potentiam tuam","Dom. 1 Adventus",M,V,03,006129d,7,,,,"Excita domine potentiam tuam et veni ut salvos facias nos",,,,,"G      DFS",,,185105
"P-BRs Nº32",,002v,1,"Aspiciebam in visu noctis et","Dom. 1 Adventus",M,R,1.2,006128,6,,,,"Aspiciebam in visu noctis et ecce in nubibus caeli filius hominis veniebat et datum est ei regnum et honor et omnis populus tribus et linguae servient ei",,,,,GBEMVHRDFS,,,185106
"P-BRs Nº32",,002v,2,"Potestas ejus potestas","Dom. 1 Adventus",M,V,01,006128b,6,,,,"Potestas ejus potestas aeterna quae non auferetur et regnum ejus quod non corrumpetur",,,,,"G   V  DFS",,,185107
"P-BRs Nº32",,003r,1,"Missus est Gabriel angelus ad ","Dom. 1 Adventus",M,R,1.3,007170,7,,,,"Missus est Gabriel angelus ad Mariam virginem desponsatam Joseph nuntians ei verbum et expavescit virgo de lumine ne timeas Maria invenisti gratiam apud dominum ecce concipies et paries et vocabitur altissimi filius",,,,,GBEMVHRDFSL,,,185108
"P-BRs Nº32",,003r,2,"Dabit ei dominus deus sedem","Dom. 1 Adventus",M,V,01,007170b,7,,,,"Dabit ei dominus deus sedem David patris ejus et regnabit in domo Jacob in aeternum",,,,,"G       FS",,,185109
"P-BRs Nº32",,003v,1,"Ponent domino gloriam et","Dom. 1 Adventus",M,A,2.,004305,5,,A,,"Ponent domino gloriam et laudem ejus in insulis nuntiabunt quia ecce veniet et non tardabit",,,,,"CGBEMVHRDF L",,,185110
"P-BRs Nº32",,003v,2,"Egredietur virga de radice","Dom. 1 Adventus",M,W,2.,008044,*,,,,"Egredietur virga de radice Jesse R. Et flos de radice ejus ascendet",,,,,"C  E VHRDFS",,,185111
"P-BRs Nº32",,003v,3,"Ave Maria gratia plena","Dom. 1 Adventus",M,R,2.1,006157,7,,,,"Ave Maria gratia plena dominus tecum spiritus sanctus superveniet in te et virtus altissimi obumbrabit tibi quod enim ex te nascetur sanctum vocabitur filius dei",,,,,GBEMVHRDFSL,,,185112
"P-BRs Nº32",,004r,1,"Quomodo fiet istud quoniam","Dom. 1 Adventus",M,V,01,006157a,7,,,,"Quomodo fiet istud quoniam virum non cognosco et respondens angelus dixit ei",,,,,"G E V  DFS",,,185113
"P-BRs Nº32",,004v,1,"Salvatorem exspectamus","Dom. 1 Adventus",M,R,2.2,007562,3,,,,"Salvatorem exspectamus dominum Jesum Christum qui reformavit corpus humilitatis nostrae configuratum corpori claritatis suae",,,,,GBEMVHRDFS,,,185114
"P-BRs Nº32",,004v,2,"Sobrie et juste et pie","Dom. 1 Adventus",M,V,01,007562b,3,,,,"Sobrie et juste et pie vivamus in hoc saeculo exspectantes beatam spem et adventum gloriae magni dei",,,,,"G   V  DFS",,,185115
"P-BRs Nº32",,004v,3,"Confortate manus fatigatas et","Dom. 1 Adventus",M,R,2.3,006321,1,,,,"Confortamini manus fatigatae et genua dissoluta roborate qui pusillo animo estis mente convalescite me timete dicit dominus quia venio dirumpere jugum captivitatis vestrae",,,,,"E V RDFSL",,,185116
"P-BRs Nº32",,005r,1,"Civitas Jerusalem noli flere","Dom. 1 Adventus",M,V,01,006321a,1,,,,"Civitas Jerusalem noli flere quia cito veniet salus tua",,,,,"E V RDFS",,,185117
"P-BRs Nº32",,005r,2,"Gloria patri et filio et*","Dom. 1 Adventus",M,V,02,909000,1,,,,"Gloria patri et filio et spiritui sancto",,,,,,,,185118
"P-BRs Nº32",,005v,1,"Gaude et laetare filia Sion","Dom. 1 Adventus",M,A,3.,002921,1,,G,,"Gaude et laetare filia Sion quia ecce ego venio et habitabo in medio tui dicit dominus",,,,,F,,,185119
"P-BRs Nº32",,005v,2,"Egredietur dominus de loco","Dom. 1 Adventus",M,W,3.,008043,*,,,,"Egredietur dominus de loco sancto suo R. Veniet ut salvet populum suum",,,,,"C BE VHRDFS",,,185120
"P-BRs Nº32",,005v,3,"Audite verbum domini gentes","Dom. 1 Adventus",M,R,3.1,006149,3,,,,"Audite verbum domini gentes et annuntiate illud in finibus vestris et in insulis quae procul sunt dicite salvator noster adveniet",,,,,GBEMVHRDFS,,,185121
"P-BRs Nº32",,006r,1,"Annuntiate et auditum facite","Dom. 1 Adventus",M,V,01,006149b,3,,,,"Annuntiate et auditum facite loquimini et clamate",,,,,"G   V  DFS",,,185122
"P-BRs Nº32",,006r,2,"Ecce virgo concipiet et","Dom. 1 Adventus",M,R,3.2,006620,3,,,,"Ecce virgo concipiet et pariet filium dicit dominus et vocabitur nomen ejus admirabilis deus fortis",,,,,GBEMVHRDFSL,,,185123
"P-BRs Nº32",,006r,3,"Super solium David et super","Dom. 1 Adventus",M,V,01,006620b,3,,,,"Super solium David et super regnum ejus sedebit in aeternum",,,,,"G   V  DFS",,,185124
"P-BRs Nº32",,006r,4,"Alieni non transibunt per","Dom. 1 Adventus",M,R,3.3,006066,4,,,,"Alieni non transibunt per Jerusalem amplius nam in illa die stillabunt montes dulcedine et colles fluent lac et mel",,,,,"EMV RDFS",,,185125
"P-BRs Nº32",,006v,1,"Tunc exsultabunt omnia ligna","Dom. 1 Adventus",M,V,01,006066d,S,,,,"Tunc exsultabunt omnia ligna silvarum ante faciem domini quoniam venit",,,,,S,,,185126
"P-BRs Nº32",,006v,2,"Gloria patri et filio et*","Dom. 1 Adventus",M,V,02,909000,S,,,,"Gloria patri et filio et spiritui sancto",,,,,,,,185127
"P-BRs Nº32",,007r,1,"In illa die stillabunt montes","Dom. 1 Adventus",L,A,1,003244,8,,G,,"In illa die stillabunt montes dulcedinem et colles fluent lac et mel alleluia",,,,,GBEMVHRDFS,,,185128
"P-BRs Nº32",,007r,2,"Jucundare filia Sion exsulta","Dom. 1 Adventus",L,A,2,003509,8,,G,,"Jucundare filia Sion exsulta satis filia Jerusalem alleluia",,,,,GBEMVHRDFS,,,185129
"P-BRs Nº32",,007r,3,"Ecce dominus veniet et omnes","Dom. 1 Adventus",L,A,3,002509,5,,A,,"Ecce dominus veniet et omnes sancti ejus cum eo et erit in die illa lux magna alleluia",,,,,GBEMVHRDFS,,,185130
"P-BRs Nº32",,007r,4,"Omnes sitientes venite ad","Dom. 1 Adventus",L,A,4,004133,7,,C,,"Omnes sitientes venite ad aquas quaerite dominum dum inveniri potest alleluia",,,,,GBEMVHRDFS,,,185131
"P-BRs Nº32",,007v,1,"Ecce veniet propheta magnus","Dom. 1 Adventus",L,A,5,002552,4,,F,,"Ecce veniet propheta magnus et ipse renovabit Jerusalem alleluia",,,,,GBEMVHRDFS,,,185132
"P-BRs Nº32",,007v,2,"Emitte agnum domine","Dom. 1 Adventus",L,W,,008051,*,,,,"Emitte agnum domine dominatorem terrae R. De petra deserti ad montem filiae Sion",,,,,"C  E    DFSL",,,185133
"P-BRs Nº32",,007v,3,"Spiritus sanctus in te","Dom. 1 Adventus",L,A,B,005006,8,,G,,"Spiritus sanctus in te descendet Maria ne timeas habebis in utero filium dei alleluia",,,,,GBEMVHRDFSL,,,185134
"P-BRs Nº32",,007v,4,"In illa die*","Dom. 1 Adventus",P,A,,003244,*,,*,,"In illa die",,,,,GBEMVHRDFS,,,185135
"P-BRs Nº32",,007v,5,"Jesu Christe fili dei vivi","Dom. 1 Adventus",P,R,,006276,r,,,,"Jesu Christe fili dei vivi miserere nobis",,,,,"B   H",,,185136
"P-BRs Nº32",,007v,6,"Qui venturus es in mundum","Dom. 1 Adventus",P,V,01,006276zh,r,,,,"Qui venturus es in mundum miserere nobis",,,,,,,,185137
"P-BRs Nº32",,007v,7,"Gloria patri et filio et*","Dom. 1 Adventus",P,V,02,909000,r,,,,"Gloria patri et filio et spiritui sancto",,,,,,,,185138
"P-BRs Nº32",,007v,8,"Exsurge domine adjuva nos","Dom. 1 Adventus",P,W,,008072,*,,,,"Exsurge domine adjuva nos R. Et libera nos propter nomen tuum",,,,,"H   S",,,185139
"P-BRs Nº32",,007v,9,"Jucundare filia*","Dom. 1 Adventus",T,A,,003509,*,,*,,,,,,,GBEMVHRDFS,,,185140
"P-BRs Nº32",,008r,1,"Veni ad liberandum nos domine ","Dom. 1 Adventus",T,R,,007823,r,,,,"Veni ad liberandum nos domine deus virtutum",,,,,"GB  VHRD S",,,185141
"P-BRs Nº32",,008r,2,"Ostende faciem tuam et salvi","Dom. 1 Adventus",T,V,01,007823a,r,,,,"Ostende faciem tuam et salvi erimus",,,,,"GB  VHRD S",,,185142
"P-BRs Nº32",,008r,3,"Gloria patri et filio et*","Dom. 1 Adventus",T,V,02,909000,r,,,,"Gloria patri et filio et spiritui sancto",,,,,,,,185143
"P-BRs Nº32",,008r,4,"Timebunt gentes nomen tuum","Dom. 1 Adventus",T,W,,008221,*,,,,"Timebunt gentes nomen tuum domine R. Et omnes reges terrae gloriam tuam",,,,,"GB  VHRDFSL",,,185144
