siglum,marginalia,folio,sequence,incipit,feast,office,genre,position,cantus_id,mode,finalis,differentia,differentia_new,fulltext_standardized,fulltext_ms,volpiano,image_link,melody_id,cao_concordances,addendum,extra,node_id
"F-Pnm Lat. 9488 ff. 33-37 (fragment)",,033r,1,"Christo cottidie sedulum exhibebat officium ","Fabiani, Sebastiani",M,R,2.1,006279,3,e,,,"Christo cottidie sedulum exhibebat officium ut christianorum animas quas in tormentis videbat deficere confortaret","Xpisto cotidie sedulum exibebat officium ut xpistianorum animas quas in tormentis videbat deficere confortaret",,https://fragmentarium.ms/view/page/F-rtpl/2955/33287,,,,,701151
"F-Pnm Lat. 9488 ff. 33-37 (fragment)",,033r,2,"Ad hoc tantum sub chlamyde ","Fabiani, Sebastiani",M,V,01,006279a,3,,,,"Ad hoc tantum sub chlamyde terreni imperii Christi militem agebat absconditum","Ad hoc tantum sub clamide terreni imperii xpisti militem agebat absconditum | Ut xpisti",,https://fragmentarium.ms/view/page/F-rtpl/2955/33287,,,,,701152
"F-Pnm Lat. 9488 ff. 33-37 (fragment)",,033r,3,"Clarissimis cottidie viris Marcelliano et ","Fabiani, Sebastiani",M,R,2.2,006294,2,d,,,"Clarissimis cottidie viris Marcelliano et Marco suadebat saeculi blandimenta respuere et momentanea tormentorum genera non timere","Clarissimis cotidie viris marcelliano et marco suadebat seculi blandimenta respueere et momentanea tormentorum genera non timere",,https://fragmentarium.ms/view/page/F-rtpl/2955/33287,,,,,701153
"F-Pnm Lat. 9488 ff. 33-37 (fragment)",,033r,4,"Beatus Sebastianus suadebat Marcelliano et ","Fabiani, Sebastiani",M,V,01,006294a,2,,,,"Beatus Sebastianus suadebat Marcelliano et Marco respuere blandimenta mulierum","Beatus sebastianus suadebat marcelliano et marco respuere blandimenta mulierum | Et momentum",,https://fragmentarium.ms/view/page/F-rtpl/2955/33287,,,,,701154
"F-Pnm Lat. 9488 ff. 33-37 (fragment)",,033r,5,"Zoe uxor Nicostrati dixit beato ","Fabiani, Sebastiani",M,R,2.3,007922,7,g,,,"Zoe uxor Nicostrati dixit beato Sebastiano beatus es tu et benedictus sermo oris tui per Jesum Christum dominum nostrum","Zoe uxor nicostrati dixit beato sebastiano beatus estu et benedictus sermo oris tui per ihesum xpistum dominum nostrum",,https://fragmentarium.ms/view/page/F-rtpl/2955/33287,,,,,701155
"F-Pnm Lat. 9488 ff. 33-37 (fragment)",,033r,6,"Benedicti qui in omnibus quae ","Fabiani, Sebastiani",M,V,01,007922a,7,,,,"Benedicti qui in omnibus quae locutus es credunt","Benedicti qui in omnibus que locutus es credunt | Per ihesum",,https://fragmentarium.ms/view/page/F-rtpl/2955/33287,,,,,701156
"F-Pnm Lat. 9488 ff. 33-37 (fragment)",,033r,7,"Beatus es tu et bene ","Fabiani, Sebastiani",M,R,2.4,006203,3,,,,"Beatus es tu et bene tibi erit egregie martyr Sebastiane quia cum sanctis gaudebis et cum angelis exsultabis in aeternum","Beatus estu et bene tibi erit egregie martyr sebastiane quia cum sanctis gaudebis et cum angelis exultabis in eternum",,https://fragmentarium.ms/view/page/F-rtpl/2955/33287,,,,,701157
"F-Pnm Lat. 9488 ff. 33-37 (fragment)",,033r,8,"Beatus es Christi martyr Sebastiane","Fabiani, Sebastiani",M,V,01,006203a,3,,,,"Beatus es Christi martyr Sebastiane","Beatus es Christi martyr Sebastiane | Quia cum",,https://fragmentarium.ms/view/page/F-rtpl/2955/33287,,,,,701158
"F-Pnm Lat. 9488 ff. 33-37 (fragment)",,033v,1,"Multitudo languentium veniebat ad eum ","Fabiani, Sebastiani",M,A,3.1,003839,8,,,118a,"Multitudo languentium veniebat ad eum et sanabantur omnes alleluia","Multitudo languentium veniebat ad eum et sanabantur omnes alleluia",,https://fragmentarium.ms/view/page/F-rtpl/2955/33288,,,,,701159
"F-Pnm Lat. 9488 ff. 33-37 (fragment)",,033v,2,"In isto loco promissio vera ","Fabiani, Sebastiani",M,R,3.1,006908,7,g,,,"In isto loco promissio vera est et peccatorum remissio splendor et lux perpetua et sine fine laetitia quam meruit Christi martyr Sebastianus","In isto loco promissio vera est et peccatorum remissio splendor et lux perpetua et sine fine leticia quam meruit xpisti martyr sebastianus",,https://fragmentarium.ms/view/page/F-rtpl/2955/33288,,,,,701160
"F-Pnm Lat. 9488 ff. 33-37 (fragment)",,033v,3,"Nolite timere non separabuntur a ","Fabiani, Sebastiani",M,V,01,006908a,7,,,,"Nolite timere non separabuntur a vobis sed vadunt in caelum parare vobis sidereas mansiones","Nolite timere non separabuntur a vobis sed vadunt in celum parare vobis sidereas mansiones | Quas meruit",,https://fragmentarium.ms/view/page/F-rtpl/2955/33288,,,,,701161
"F-Pnm Lat. 9488 ff. 33-37 (fragment)",,033v,4,"Nolite timere non separabuntur a ","Fabiani, Sebastiani",M,R,3.2,007221,7,g,,,"Nolite timere non separabuntur a vobis sed vadunt in caelum parare vobis sidereas mansiones","Nolite timere non separabuntur a vobis sed vadunt in celum parare vobis sidereas mansiones",,https://fragmentarium.ms/view/page/F-rtpl/2955/33288,,,,,701162
"F-Pnm Lat. 9488 ff. 33-37 (fragment)",,033v,5,"Quas meruit Christi martyr Sebastianus","Fabiani, Sebastiani",M,V,01,007221b,7,,,,"Quas meruit Christi martyr Sebastianus","Quas meruit xpisti martyr sebastianus",,https://fragmentarium.ms/view/page/F-rtpl/2955/33288,,,,,701163
"F-Pnm Lat. 9488 ff. 33-37 (fragment)",,033v,6,"Elegit dominus virum de plebe ","Fabiani, Sebastiani",M,R,3.3,006647,7,g,,,"Elegit dominus virum de plebe et claritatem visionis aeternae dedit illi celebremus sollemnitatem Sebastiani martyris gaudium sit in caelo et in terra pax in hominibus bonae voluntatis","Elegit dominus virum de plebe et claritatem visionis eterne dedit illi celebremus sollempnitatem sebastiani martiris gaudium sit in celo et in terra pax in hominibus bone voluntatis",,https://fragmentarium.ms/view/page/F-rtpl/2955/33288,,,,,701164
"F-Pnm Lat. 9488 ff. 33-37 (fragment)",,033v,7,"Beatus es et bene tibi ","Fabiani, Sebastiani",M,V,01,006647a,7,,,,"Beatus es et bene tibi erit egregie dei martyr Sebastiane","Beatus es et bene tibi erit egregie dei martir sebastiane | Gaudium",,https://fragmentarium.ms/view/page/F-rtpl/2955/33288,,,,,701165
"F-Pnm Lat. 9488 ff. 33-37 (fragment)",,033v,8,"Egregie Christi martyr Sebastiane princeps ","Fabiani, Sebastiani",M,R,"3.4 ",006643,7,g,,,"Egregie Christi martyr Sebastiane princeps ac propagator sanctissimorum praeceptorum ecce nomen tuum in libro vitae caelestis adscriptum est et memoriale tuum non derelinquetur in saecula","Egregie xpisti martyr sebastiane princeps ac propagator sanctissimorum preceptorum ecce nomen tuum in libro vite celestis ascriptum est et memoriale tuum non derelinquetur in secula",,https://fragmentarium.ms/view/page/F-rtpl/2955/33288,,,,,701166
"F-Pnm Lat. 9488 ff. 33-37 (fragment)",,034r,0,-nam,"Fabiani, Sebastiani",M,A,1.3,,1,d,,64b,-nam,"-nam | euouae | Cum invocarem",,https://fragmentarium.ms/view/page/F-rtpl/2955/33289,,,,,701120
"F-Pnm Lat. 9488 ff. 33-37 (fragment)",,034r,1,"Erat enim in sermone verax ","Fabiani, Sebastiani",M,A,1.4,002653,8,g,,99d,"Erat enim in sermone verax in judicio justus","Erat enim in sermone verax in iudicio iustus | euouae | Verba mea",,https://fragmentarium.ms/view/page/F-rtpl/2955/33289,,,,,701121
"F-Pnm Lat. 9488 ff. 33-37 (fragment)",,034r,2,"Christo cottidie sedulum exhibebat officium ","Fabiani, Sebastiani",M,A,1.5,001789,7?,g,,,"Christo cottidie sedulum exhibebat officium erat enim verus dei cultor","Christo cotidie sedulum exibebat officium erat enim verus dei cultor | euouae | domine dominus",,https://fragmentarium.ms/view/page/F-rtpl/2955/33289,,,,,701122
"F-Pnm Lat. 9488 ff. 33-37 (fragment)",,034r,3,"Sebastianus dixit Marcelliano et Marco ","Fabiani, Sebastiani",M,A,1.6,004842,8,g,,118a,"Sebastianus dixit Marcelliano et Marco non vos seducant blandimenta mulierum","Sebastianus dixit marcelliano et marco non vos seducant blandimenta mulierum | euouae | Domine quis habitabit",,https://fragmentarium.ms/view/page/F-rtpl/2955/33289,,,,,701123
"F-Pnm Lat. 9488 ff. 33-37 (fragment)",,034r,4,"Sebastianus dei cultor studiose curabat ","Fabiani, Sebastiani",M,R,1.1,007631,?,,,,"Sebastianus dei cultor studiose curabat sub absconso chlamydis sanctorum animas confortare spem promittens et gloriam consequi sempiternam","Sebastianus dei cultor studiose curabat sub absconso clamidis sanctorum animas confortare spem promittens et gloriam consequi sempiternam",,https://fragmentarium.ms/view/page/F-rtpl/2955/33289,,,,,701124
"F-Pnm Lat. 9488 ff. 33-37 (fragment)",,034r,5,"Erat enim in sermone verax ","Fabiani, Sebastiani",M,V,01,007631a,?,,,,"Erat enim in sermone verax in judicio justus","Erat enim in sermone verax in iudicio iustus | Spem",,https://fragmentarium.ms/view/page/F-rtpl/2955/33289,,,,,701125
"F-Pnm Lat. 9488 ff. 33-37 (fragment)",,034r,6,"Erat enim in sermone verax ","Fabiani, Sebastiani",M,R,1.2,006663,7,g,,,"Erat enim in sermone verax in judicio justus in consilio providus in bonitate conspicuus in universa morum honestate praeclarus","Erat enim in sermone verax in iudicio iustus in consilio providus in bonitate conspicuus in universa morum honestate preclarus",,https://fragmentarium.ms/view/page/F-rtpl/2955/33289,,,,,701126
"F-Pnm Lat. 9488 ff. 33-37 (fragment)",,034r,7,"In commisso quoque fidelis in ","Fabiani, Sebastiani",M,V,01,006663a,7,g,,,"In commisso quoque fidelis in interventu strenuus","In commisso quoque fidelis in interventu strenuus | In universa ",,https://fragmentarium.ms/view/page/F-rtpl/2955/33289,,,,,701127
"F-Pnm Lat. 9488 ff. 33-37 (fragment)",,034r,8,"Sebastianus vir christianissimus quem occultabat ","Fabiani, Sebastiani",M,R,1.3,007633,4,E,,,"Sebastianus vir christianissimus quem occultabat militaris habitus et chlamydis suae obumbrabat aspectus","Sebastianus vir xpistianissimus quem occultabat militaris habitus et clamidis sue obumbrabat aspectus",,https://fragmentarium.ms/view/page/F-rtpl/2955/33289,,,,,701128
"F-Pnm Lat. 9488 ff. 33-37 (fragment)",,034r,9,"Quem perfuderat deus gratia ab ","Fabiani, Sebastiani",M,V,01,007633a,4,,,,"Quem perfuderat deus gratia ab omnibus amabatur","Quem perfuderat deus gratia ab omnibus amabatur | Et clamidia",,https://fragmentarium.ms/view/page/F-rtpl/2955/33289,,,,,701129
"F-Pnm Lat. 9488 ff. 33-37 (fragment)",,034v,1,"Ad hoc tantum sub chlamyde ","Fabiani, Sebastiani",M,R,1.4,006023,8,,,,"Ad hoc tantum sub chlamyde Christi militem tegebat absconditum ut deo redderet animas quas diabolus conabatur auferre","Ad hoc tantum sub clamide xpisti militem tegebat absconditum ut deo redderet animas quas diabolus conabatur auferre",,https://fragmentarium.ms/view/page/F-rtpl/2955/33290,,,,,701130
"F-Pnm Lat. 9488 ff. 33-37 (fragment)",,034v,2,"Sebastianus vir christianissimus quem occultabat ","Fabiani, Sebastiani",M,V,01,006023a,8,,,,"Sebastianus vir christianissimus quem occultabat militaris habitus","Sebastianus vir xpistianissimus quem occultabat militaris habitus | Ut deo",,https://fragmentarium.ms/view/page/F-rtpl/2955/33290,,,,,701131
"F-Pnm Lat. 9488 ff. 33-37 (fragment)",,034v,3,"Polycarpus presbyter dixit beato Sebastiano ","Fabiani, Sebastiani",M,A,2.1,004300,8,g,,118a,"Polycarpus presbyter dixit beato Sebastiano beatus es tu quia audisti vocem domini Jesu Christi","Policarpus presbiter dixit beato sebastiano beatus estu quia audisti vocem domini ihesu xpisti | Euouae | Conserva",,https://fragmentarium.ms/view/page/F-rtpl/2955/33290,,,,,701132
"F-Pnm Lat. 9488 ff. 33-37 (fragment)",,034v,4,"Zoe uxor Nicostrati dixit beato ","Fabiani, Sebastiani",M,A,2.2,005517,8,g,,118a,"Zoe uxor Nicostrati dixit beato Sebastiano beatus es tu et benedictus sermo oris tui","Zoe uxor nicostrati dixit beato sebastiano beatus estu et benedictus sermo oris tui | Euouae | Domini est terra",,https://fragmentarium.ms/view/page/F-rtpl/2955/3328794,,,,,701133
"F-Pnm Lat. 9488 ff. 33-37 (fragment)",,034v,5,"Nolite timere non separabuntur a ","Fabiani, Sebastiani",M,A,2.3,003897,8,g,,,"Nolite timere non separabuntur a vobis sed vadunt in caelum parare vobis sidereas mansiones","Nolite timere non separabuntur a vobis sed vadunt in celum parare vobis sidereas mansiones| euouae | Beati quorum",,https://fragmentarium.ms/view/page/F-rtpl/2955/33290,,,,,701134
"F-Pnm Lat. 9488 ff. 33-37 (fragment)",,034v,6,"Sonant ibi jugiter organa hymnorum ","Fabiani, Sebastiani",M,A,2.4,004983,1,d,,66d,"Sonant ibi jugiter organa hymnorum quae ad laudem dei ab angelis et archangelis decantantur","Sonant ibi iugiter organa ymnorum que ad laudem dei ab angelis et archangelis decantantur | euouae | Exultate iusti",,https://fragmentarium.ms/view/page/F-rtpl/2955/33290,,,,,701148
"F-Pnm Lat. 9488 ff. 33-37 (fragment)",,034v,7,"Egregie Christi martyr Sebastiane princeps ","Fabiani, Sebastiani",M,A,2.5,002614,1,d,,58a,"Egregie Christi martyr Sebastiane princeps ac propagator sanctissimorum praeceptorum ecce nomen tuum in libro vitae caelestis adscriptum est et memoriale tuum non derelinquetur in saecula","Egregie xpisti martyr sebastiane princeps ac propagator sanctissimorum preceptorum ecce nomen tuum in libro vite celestis ascriptum est et memoriale tuum non derelinquetur in secula | euouae | Te decet",,https://fragmentarium.ms/view/page/F-rtpl/2955/33290,,,,,701149
"F-Pnm Lat. 9488 ff. 33-37 (fragment)",,034v,8,"Beatus es et bene tibi ","Fabiani, Sebastiani",M,A,2.6,001623,8,g,,99d,"Beatus es et bene tibi erit egregie martyr Sebastiane quia cum sanctis gaudebis et cum angelis exsultabis in aeternum","Beatus es et bene tibi erit egregie martyr Sebastiane quia cum sanctis gaudebis et cum angelis exultabis in aeternum | euouae | Deus venerunt",,https://fragmentarium.ms/view/page/F-rtpl/2955/33290,,,,,701150
"F-Pnm Lat. 9488 ff. 33-37 (fragment)",,035r,0,"Exaudi deus orationem meam cum ","Joannis Evang.",M,W,1.,,r,,,,"Exaudi deus orationem meam cum deprecor","Exaudi deus orationem meam cum deprecor",,https://fragmentarium.ms/view/page/F-rtpl/2955/33291,,,,,701072
"F-Pnm Lat. 9488 ff. 33-37 (fragment)",,035r,1,"Qui vicerit faciam illum columnam ","Joannis Evang.",M,R,1.1,007486,1,D,,,"Qui vicerit faciam illum columnam in templo meo dicit dominus et scribam super eum nomen meum et nomen civitatis novae Jerusalem","Qui vicerit faciam illum columpnam in templo meo dicit dominus et scribam super eum nomen meum et nomen civitatis nove iherusalem",,https://fragmentarium.ms/view/page/F-rtpl/2955/33291,,,,,701073
"F-Pnm Lat. 9488 ff. 33-37 (fragment)",,035r,2,"Vincenti dabo edere de ligno ","Joannis Evang.",M,V,01,007486b,1,,,,"Vincenti dabo edere de ligno vitae quod est in paradiso dei mei","Vicenti dabo edere de ligno vite quod est in paradyso dei mei | Et scribam",,https://fragmentarium.ms/view/page/F-rtpl/2955/33291,,,,,701074
"F-Pnm Lat. 9488 ff. 33-37 (fragment)",,035r,3,"Hic est discipulus qui testimonium ","Joannis Evang.",M,R,1.2,006822,7,,,,"Hic est discipulus qui testimonium perhibet de his et scripsit haec et scimus quia verum est testimonium ejus","Hic est discipulus qui testimonium perhibet de his et scripsit hec et scimus quia verum est testimonium eius",,https://fragmentarium.ms/view/page/F-rtpl/2955/33291,,,,,701075
"F-Pnm Lat. 9488 ff. 33-37 (fragment)",,035r,4,"Fluenta evangelii de ipso sacro ","Joannis Evang.",M,V,01,006822e,7,,,,"Fluenta evangelii de ipso sacro dominici pectoris fonte potavit et verbi dei gratiam in toto terrarum orbe diffudit","Fluenta evangelii de ipso sacro dominici pectoris fonte potavit et verbi dei gratiam in toto terrarum orbe diffudit | Et scimus",,https://fragmentarium.ms/view/page/F-rtpl/2955/33291,,,,,701076
"F-Pnm Lat. 9488 ff. 33-37 (fragment)",,035r,5,"Valde honorandus est beatus Joannes ","Joannis Evang.",M,R,1.3,007817,2,D,,,"Valde honorandus est beatus Joannes qui supra pectus domini in cena recubuit cui Christus in cruce matrem virginem virgini commendabat","Valde honorandus est beatus iohannes qui supra pectus domini in cena recubuit cui xpistus in cruce matrem virginem virgini commendabat",,https://fragmentarium.ms/view/page/F-rtpl/2955/33291,,,,,701077
"F-Pnm Lat. 9488 ff. 33-37 (fragment)",,035r,6,"Virgo est electus a domino ","Joannis Evang.",M,V,01,007817b,2,,,,"Virgo est electus a domino atque inter ceteros magis dilectus","Virgo est electus a domino atque inter ceteros magis dilectus | Cui xpistus",,https://fragmentarium.ms/view/page/F-rtpl/2955/33291,,,,,701078
"F-Pnm Lat. 9488 ff. 33-37 (fragment)",,035r,7,"Similitudo vultus*","Joannis Evang.",M,R,1.4,007671,?,,,,"Similitudo vultus*","Similitudo vultus*",,https://fragmentarium.ms/view/page/F-rtpl/2955/33291,,,,,701079
"F-Pnm Lat. 9488 ff. 33-37 (fragment)",,035r,8,"Duae pennae*","Joannis Evang.",M,V,01,007671a,?,,,,"Duae pennae*","Due penne*",,https://fragmentarium.ms/view/page/F-rtpl/2955/33291,,,,,701080
"F-Pnm Lat. 9488 ff. 33-37 (fragment)",,035r,9,"Cum autem beatus Johannes ingrederetur ","Joannis Evang.",M,A,2.1,a02689,4,e,,358a,"Cum autem beatus Johannes ingrederetur civitatem Drusiana quae semper eum fuerat secuta deo serviens in castitate et humilitate perfecta desiderio redditus ejus fatigata sed morte preventa efferebatur mortua","Cum autem beatus ioannes ingrederetur civitatem drusiana quae semper eum fuerat secuta deo serviens in castitate et humilitate perfecta desiderio redditus eius fatigata sed morte preventa efferebatur mortua | euouae | Confitebimur",c---df--f---f--fe--d---df--ed--d---e--g--gh--hk--hgf---gh--gf--f--ef-g---gf--df--d--c---fe---d--df---f--ef---g--f--g---ghg--e--e---e--g---gh--h--h---hg---hk--hg--hg--f---e---f--g--f--gh--gf---ef--e--e---f--d--d--dc--d---df--gh--hg--fg---gf--dc---d--f--f--f---f---fe--d---df--dc--c---fed--e--f--g--ghg---f--de--e---|---h--g--h--kh--gf--ed---|---h--g--h--h--h---,https://fragmentarium.ms/view/page/F-rtpl/2955/33291,,,,,701114
"F-Pnm Lat. 9488 ff. 33-37 (fragment)",,035v,1,"Ut vidit vero beatus Johannes ","Joannis Evang.",M,A,2.2,a02690,5,F,,129a,"Ut vidit vero beatus Johannes pauperes ac viduas cum parentibus flentes feretrum deponi jussit et clara voce dixit Drusiana suscitet te Jesus Christus surge et ad domum tuam revertere sana","Ut vidit vero beatus iohannes pauperes ac viduas cum parentibus flentes feretrum deponi iussit et clara voce dixit drusiana suscitet te ihesus xpristus surge et ad domum tu{am} revertere sana | euouae | Cantate domino i",d---fe--gk---kl--k---k--kijh--h---gh--f--f---h--g--f---h---kl--k--k---k---l--mlk--l--lml---k--k---ijh--jk--k---k--ln--lk---l--j---hij---k--jg---h--gh---f--f---h--g--hkl--k---l--k--l---nlk---ln--l---k--k---h-jk--k---k---kl---lk--ijk---kjh--6------6---h--hgf--g--ghg---f--f---|---k--k--l--j--k--h---|---f--h--k------,https://fragmentarium.ms/view/page/F-rtpl/2955/33292,,,,,701115
"F-Pnm Lat. 9488 ff. 33-37 (fragment)",,035v,2,"At illa surrexit ad hanc ","Joannis Evang.",M,A,2.3,a02691,6,F,,7a,"At illa surrexit ad hanc vocem atque abire coepit ita ut videretur ipsi Drusiane non quod a  morte sed quasi a somno excitasset eam","At illa surrexit ad hanc {#} atque abire cepit ita ut videretur ipsi drusiane non quod a {#} sed quasi a somno excitasset eam | euouae | Dominus regnavit exultet",f---gh--f---f--fe--d---c---df---6------6---f-gh--hg-ijh---gf--g--ghg---f--f---f--c---d---c--df--ffg--f---f--g---h--gf--g--f---f---f---gh---6------6---f---gh--h---gf---gf--dc---g--gf--g--ghg---f--f---|---h--h--f--gh--g--f---|---f--g--h---h--h--h---h--k--h---,https://fragmentarium.ms/view/page/F-rtpl/2955/33292,,,,,701116
"F-Pnm Lat. 9488 ff. 33-37 (fragment)",,035v,3,"Apparuit caro suo Joanni dominus ","Joannis Evang.",M,A,2.4,001458,7,g,,143d,"Apparuit caro suo Joanni dominus Jesus Christus cum discipulis suis et ait illi veni dilecte mi ad me quia tempus est ut epuleris in convivio meo cum fratribus tuis","Apparuit caro suo iohanni dominus ihesus xpistus cum discipulis suis et ait illi veni dilecte mi ad me quia tempus est ut epuleris in convivio meo cum fratribus tuis | euouae | Cantate ii",,https://fragmentarium.ms/view/page/F-rtpl/2955/33292,,,,,701117
"F-Pnm Lat. 9488 ff. 33-37 (fragment)",,035v,4,"Expandens manus suas ad deum ","Joannis Evang.",M,A,2.5,002795,8,G,,118a,"Expandens manus suas ad deum dixit invitatus ad convivium tuum venio gratias agens quia me dignatus es domine Jesu Christe ad tuas epulas invitare sciens quod ex toto corde meo desiderabam te","Expandens manus suas ad deum dixit invitatus ad convivium tuum venio gratias agens quia me dignatus es domine ihesu xpriste ad tuas epulas invitare sciens quod ex toto corde meo desiderabam te | euouae | Dominus regnavit ira",,https://fragmentarium.ms/view/page/F-rtpl/2955/33292,,,,,701118
"F-Pnm Lat. 9488 ff. 33-37 (fragment)",,035v,5,"Domine suscipe me ut cum ","Joannis Evang.",M,A,2.6,002391,?,,,,"Domine suscipe me ut cum fratribus meis sim cum quibus veniens invitasti me aperi mihi janua vitae et perduc me ad convivium epularum  [tuarum tu es enim Christus filius dei vivi qui praecepto patris mundum salvasti tibi gratias referimus per infinita saeculorum saecula]","Domine suscipe me ut cum fratribus meis sim cum quibus veniens invitasti me aperi michi ianuam vite et perduc me ad convivium epularum {#}",,https://fragmentarium.ms/view/page/F-rtpl/2955/33292,,,,,701119
"F-Pnm Lat. 9488 ff. 33-37 (fragment)",,036r,1,"Socius enim factus es supernarum ","Fabiani, Sebastiani",M,V,01,006643a,7,,,,"Socius enim factus es supernarum virtutum quae et in caelis spiritum tuum susceperunt","Socius enim factus es supernarum virtutum que et in celis spiritum tuum susceperunt | Et memor | Gloria patri",,https://fragmentarium.ms/view/page/F-rtpl/2955/33293,,,,,701167
"F-Pnm Lat. 9488 ff. 33-37 (fragment)",,036r,2,"Ad hoc tantum sub chlamyde ","Fabiani, Sebastiani",L,A,1,001245,1,d,,66d,"Ad hoc tantum sub chlamyde Christi militem tegebat absconditum ut deo redderet animas quas diabolus conabatur auferre","Ad hoc tantum sub clamide xpisti militem tegebat absconditum ut deo redderet animas quas diabolus conabatur auferre",,https://fragmentarium.ms/view/page/F-rtpl/2955/33293,,,,,701168
"F-Pnm Lat. 9488 ff. 33-37 (fragment)",,036r,3,"Clarissimis cottidie viris Marcelliano et ","Fabiani, Sebastiani",L,A,2,001827,8,,,118a,"Clarissimis cottidie viris Marcelliano et Marco suadebat saeculi blandimenta respuere et momentanea tormentorum genera non timere","Clarissimis cotidie viris marcelliano et marco suadebat seculi blandimenta respuere et momentanea tormentorum genera non timere",,https://fragmentarium.ms/view/page/F-rtpl/2955/33293,,,,,701169
"F-Pnm Lat. 9488 ff. 33-37 (fragment)",,036r,4,"Si ego verus Christi servus ","Fabiani, Sebastiani",L,A,3,004891,6,F,,7a,"Si ego verus Christi servus sum et si vera sunt omnia quae ex ore meo haec mulier audivit et credidit aperiat os ejus qui aperuit os Zachariae prophetae domini","Si ego verus xpisti servus sum et si vera sunt omnia que ex ore meo hec mulier audivit et credidit aperiat os ejus qui aperuit os zacharie prophete domini",,https://fragmentarium.ms/view/page/F-rtpl/2955/33293,,,,,701170
"F-Pnm Lat. 9488 ff. 33-37 (fragment)",,036r,5,"Ad hanc vocem Christi martyris ","Fabiani, Sebastiani",L,A,4,001244,1,d,,66d,"Ad hanc vocem Christi martyris Sebastiani illico apertum est os uxoris Nicostrati","Ad hanc vocem xpisti martyris sebastiani ilico apertum est os uxoris nicostrati",,https://fragmentarium.ms/view/page/F-rtpl/2955/33293,,,,,701171
"F-Pnm Lat. 9488 ff. 33-37 (fragment)",,036r,6,"Sanctus Sebastianus dixit Nicostrato salvator ","Fabiani, Sebastiani",L,A,5,004798,1,d,,66d,"Sanctus Sebastianus dixit Nicostrato salvator noster pro peccatoribus exhibere dignatus est suam praesentiam","Sanctus sebastianus dixit nicostrato salvator noster pro peccatoribus exibere dignatus est suam presentiam",,https://fragmentarium.ms/view/page/F-rtpl/2955/33293,,,,,701172