siglum,marginalia,folio,sequence,incipit,feast,office,genre,position,cantus_id,mode,finalis,differentia,differentia_new,fulltext_standardized,fulltext_ms,volpiano,image_link,melody_id,cao_concordances,addendum,extra,node_id
"I-VCd LXIV",,001r,1,"Alleluia iii","Dom. Resurrectionis",M,I,,001023,7,,,,"Alleluia alleluia alleluia",,,,,"CGBEMVHRD S",,,576330
"I-VCd LXIV",,001r,2,Venite*,"Dom. Resurrectionis",M,IP,,909030,,,,,Venite*,,,,,,,,576331
"I-VCd LXIV",,001r,3,"Ego sum qui sum et ","Dom. Resurrectionis",M,A,1.1,002599,2,,1,150e,"Ego sum qui sum et consilium meum non est cum impiis sed in lege domini voluntas mea est alleluia",,,,,CGBEMVHRDFSL,,,576332
"I-VCd LXIV",,001r,4,"Postulavi patrem meum alleluia dedit ","Dom. Resurrectionis",M,A,1.2,004342,2,,1,150e,"Postulavi patrem meum alleluia dedit mihi gentes alleluia in hereditatem alleluia",,,,,CGBEMVHRDFSL,,,576333
"I-VCd LXIV",,001r,5,"Ego dormivi et somnum coepi ","Dom. Resurrectionis",M,A,1.3,002572,8,,3,99d,"Ego dormivi et somnum coepi et resurrexi quoniam dominus suscepit me alleluia alleluia",,,,,CGBEMVHRDFSL,,,576334
"I-VCd LXIV",,001v,1,"Resurrexit dominus","Dom. Resurrectionis",M,W,1.,008185,r,,,,"Resurrexit dominus",,,,,"CG EMV R  S",,,576335
"I-VCd LXIV",,001v,2,"Angelus domini descendit de","Dom. Resurrectionis",M,R,1.1,006093,3,,,,"Angelus domini descendit de caelo et accendens revolvit lapidem et super eum sedit et dixit mulieribus nolite timere scio enim quia crucifixum quaeritis jam surrexit venite et videte locum ubi positus erat dominus alleluia",,,,,CGBEMVHRDFSL,,,576336
"I-VCd LXIV",,001v,3,"Et introeuntes in monumentum","Dom. Resurrectionis",M,V,01,006093b,3,,,,"Et introeuntes in monumentum viderunt juvenem sedentem in dextris coopertum stola candida et obstupuerunt qui dicit illis",,,,,SL,,,576337
"I-VCd LXIV",,002r,1,"Angelus domini locutus est","Dom. Resurrectionis",M,R,1.2,006095,5,,,,"Angelus domini locutus est mulieribus dicens quem quaeritis an Jesum quaeritis jam surrexit venite et videte alleluia alleluia",,,,,CGBEMVHRDFSL,,,576338
"I-VCd LXIV",,002r,2,"Ecce praecedet vos in","Dom. Resurrectionis",M,V,01,006095a,5,,,,"Ecce praecedet vos in Galilaeam ibi eum videbitis sicut dixit vobis",,,,,CGBEMVHRDFS,,,576339
"I-VCd LXIV",,002r,3,"Dum transisset sabbatum Maria","Dom. Resurrectionis",M,R,1.3,006565,4,,,,"Dum transisset sabbatum Maria Magdalenae et Maria Jacobi et Salome emerunt aromata ut venientes ungerent Jesum alleluia alleluia",,,,,CGBEMVHRDFSL,,,576340
"I-VCd LXIV",,002v,1,"Et valde mane una sabbatorum","Dom. Resurrectionis",M,V,01,006565a,4,,,,"Et valde mane una sabbatorum veniunt ad monumentum orto jam sole",,,,,CGBEMVHRDFSL,,,576341
"I-VCd LXIV",,002v,2,"Alleluia vii","Dom. Resurrectionis",L,A,p,001332,8,,*,,"Alleluia alleluia alleluia alleluia alleluia alleluia alleluia",,,,,,,,576342
"I-VCd LXIV",,002v,3,"Haec dies*","Dom. Resurrectionis",L,R,,006797,7*?,,,,"Haec dies*",,,,,E,,,576343
"I-VCd LXIV",,002v,4,"Et valde mane una sabbatorum ","Dom. Resurrectionis",L,A,B,002728,8,,1,118a,"Et valde mane una sabbatorum veniunt ad monumentum orto jam sole alleluia",,,,,CGBEMVHRDFSL,,,576344
"I-VCd LXIV",,002v,5,"Praecedet vos in Galilaeam ibi ","Dom. Resurrectionis",L,A,P,004352,8,,*,,"Praecedet vos in Galilaeam ibi me videbitis sicut dixit vobis alleluia",,,,,"CG      DF L",,,576345
"I-VCd LXIV",R,003r,1,Alleluia,"Dom. Resurrectionis",V2,A,p,,?,,,,Alleluia,,,,,,,,576346
"I-VCd LXIV",,003r,2,"Et dicebant ad invicem quis ","Dom. Resurrectionis",V2,A,M,002697,8,,1,118a,"Et dicebant ad invicem quis revolvet nobis lapidem ab ostio monumenti alleluia alleluia",,,,,"CGBE VHRDFS",,,576347
"I-VCd LXIV",,003r,3,"Et respicientes viderunt revolutum lapidem ","Dom. Resurrectionis",V2,A,P,002718,3,,5,101b,"Et respicientes viderunt revolutum lapidem erat quippe magnus valde alleluia",,,,,CGBEMVHRDFSL,,,576348
"I-VCd LXIV",,003r,4,"Crucifixum in carne laudemus","Suff. Crucis TP",M,A,R,001955,2,,*,,"Crucifixum in carne laudemus et sepultum propter nos glorificemus resurgentem de morte venite adoremus alleluia alleluia alleluia",,,,,L,,,576349
"I-VCd LXIV",,003v,1,"Christus resurgens ex mortuis jam ","Suff. Crucis TP",V,A,R,001796,1T,,6,T304a,"Christus resurgens ex mortuis jam non moritur mors illi ultra non dominabitur quod enim vivit vivit deo alleluia",,,,,"GBEMV RDFSL",,,576350
"I-VCd LXIV",,003v,2,"Surrexit dominus vere","Fer. 2 p. Pascha",M,I,,001166,6,,,,"Surrexit dominus vere alleluia",,,,,"CGBEMVHRD SL",,,576351
"I-VCd LXIV",,003v,3,"Venite exsultemus domino","Fer. 2 p. Pascha",M,IP,,909030,,,,,"Venite exsultemus domino jubilemus deo salutari nostro praeoccupemus faciem ejus in confessione et in psalmis jubilemus ei",,,,,,,,576352
"I-VCd LXIV",,004r,1,"Alleluia i","Fer. 2 p. Pascha",M,A,p,001326,8,,*,,,,,,,"CG EMV  DFS",,,576353
"I-VCd LXIV",,004r,2,"Surrexit dominus vere","Fer. 2 p. Pascha",M,W,1.,008213,*,,,,"Surrexit dominus vere",,,,,"C BEMVHR  SL",,,576354
"I-VCd LXIV",,004r,3,"Maria Magdalenae et altera","Fer. 2 p. Pascha",M,R,1.1,007128,8,,,,"Maria Magdalenae et altera Maria ibant diluculo ad monumentum Jesum quem quaeritis non est hic surrexit sicut locutus est praecedet vos in Galilaeam ibi eum videbitis alleluia alleluia",,,,,CGBEMVHRDFSL,,,576355
"I-VCd LXIV",,004r,4,"Cito euntes dicite discipulis","Fer. 2 p. Pascha",M,V,01,007128a,8,,,,"Cito euntes dicite discipulis ejus et Petro quia surrexit dominus",,,,,CGBEMVHRDFS,,,576356
"I-VCd LXIV",,004r,5,"Surgens Jesus dominus noster","Fer. 2 p. Pascha",M,R,1.2,007734,7,,,,"Surgens Jesus dominus noster stans in medio discipulorum suorum dixit pax vobis alleluia gavisi sunt discipuli viso domino alleluia",,,,,CGBEMVHRDFSL,,,576357
"I-VCd LXIV",,004v,1,"Una ergo sabbatorum cum fores ","Fer. 2 p. Pascha",M,V,01,,7,,,,"Una ergo sabbatorum cum fores essent clausae ubi erant discipuli congregati venit Jesus et stetit in medio et dixit eis",,,,,,,,576358
"I-VCd LXIV",,004v,2,"Congratulamini mihi omnes qui","Fer. 2 p. Pascha",M,R,1.3,006323,3,,,,"Congratulamini mihi omnes qui diligitis dominum quia quem quaerebam apparuit mihi et dum flerem ad monumentum vidi dominum meum alleluia",,,,,CGBEMVHRDFSL,,,576359
"I-VCd LXIV",,005r,1,"Recedentibus discipulis non","Fer. 2 p. Pascha",M,V,01,006323b,3,,,,"Recedentibus discipulis non recedebam et amoris ejus ignis succensa ardebam desiderio",,,,,DFSL,,,576360
"I-VCd LXIV",,005r,2,"Qui sunt hi sermones quos ","Fer. 2 p. Pascha",E,A,1,004500,8,,1,118a,"Qui sunt hi sermones quos confertis ad invicem ambulantes et estis tristes alleluia alleluia respondens unus cui nomen Cleophas dixit ei tu solus peregrinus es in Jerusalem et non cognovisti quae facta sunt in illa his diebus alleluia quibus ille dixit quae et dixerunt de Jesu Nazareno qui fuit vir propheta potens in opere et sermone coram deo et omni populo alleluia alleluia",,,,,"CGBEMVHR FS",,,576361
"I-VCd LXIV",,005v,1,"Alleluia alleluia alleluia alleluia alleluia ","Fer. 2 p. Pascha",L,A,p,001332,2,,1,150e,"Alleluia alleluia alleluia alleluia alleluia alleluia alleluia",,,,,,,,576362
"I-VCd LXIV",,005v,2,"Nonne cor nostrum ardens erat ","Fer. 2 p. Pascha",E,A,2,003943,2,,1,150e,"Nonne cor nostrum ardens erat in nobis de Jesu dum loqueretur nobis in via alleluia",,,,,"G E VHR FSL",,,576363
"I-VCd LXIV",,005v,3,"Tu solus peregrinus es et ","Fer. 2 p. Pascha",E,A,3,005222,1,,2,66d,"Tu solus peregrinus es et non cognovisti de Jesu quomodo tradiderunt eum in damnationem mortis alleluia",,,,,"CG E  HRDF",,,576364
"I-VCd LXIV",,006r,1,"Mane nobiscum quoniam advesperascit et ","Fer. 2 p. Pascha",E,A,4,003690,7,,3,143b,"Mane nobiscum quoniam advesperascit et inclinata est jam dies alleluia alleluia",,,,,"C  EM HRDF L",,,576365
"I-VCd LXIV",,006r,2,"Ardens est cor meum desidero ","Fer. 2 p. Pascha",E,A,5,001479,8,,4,120a,"Ardens est cor meum desidero videre dominum meum quaero et non invenio ubi posuerunt eum alleluia",,,,,"CG EM HRDFSL",,,576366
"I-VCd LXIV",,006r,3,"Surrexit dominus vere alleluia et ","Fer. 2 p. Pascha",E,A,6,005080,6,,1,7a,"Surrexit dominus vere alleluia et apparuit Simoni alleluia",,,,,"C     HRDF L",,,576367
"I-VCd LXIV",,006r,4,Surrexit*,"Fer. 3 p. Pascha",M,I,,001166,6,,,,Surrexit*,,,,,"CGBEMVHRD SL",,,576368
"I-VCd LXIV",,006r,5,Venite*,"Fer. 3 p. Pascha",M,IP,,909030,,,,,Venite*,,,,,,,,576369
"I-VCd LXIV",,006r,6,"Alleluia i","Fer. 3 p. Pascha",L,A,p,001326,6T,,,,,,,,,"CG EMV  DFS",,,576370
"I-VCd LXIV",,006v,1,Surrexit*,"Fer. 3 p. Pascha",M,W,,008212,*,,,,Surrexit*,,,,,"C  EMVHRD SL",,,576371
"I-VCd LXIV",,006v,2,"Virtute magna reddebant","Fer. 3 p. Pascha",M,R,1.1,007907,3,,,,"Virtute magna reddebant apostoli testimonium resurrectionis Jesu Christi domini nostri alleluia alleluia",,,,,CGBEMVHRDFSL,,,576372
"I-VCd LXIV",,006v,3,"Repleti quidem spiritu sancto","Fer. 3 p. Pascha",M,V,01,007907b,3,,,,"Repleti quidem spiritu sancto loquebantur cum fiducia",,,,,"G      DFSL",,,576373
"I-VCd LXIV",,006v,4,"Tulerunt dominum meum et","Fer. 3 p. Pascha",M,R,1.2,007797,8,,,,"Tulerunt dominum meum et nescio ubi posuerunt eum ait illi angelus noli flere Maria surrexit sicut dixit praecedet vos in Galilaeam ibi eum videbitis alleluia alleluia",,,,,CGBEMVHRDFSL,,,576374
"I-VCd LXIV",,007r,1,"Cito euntes*","Fer. 3 p. Pascha",M,V,01,007797a,8,,,,"Cito euntes*",,,,,CGBEMVHR,,,576375
"I-VCd LXIV",,007r,2,"Expurgate vetus fermentum ut","Fer. 3 p. Pascha",M,R,1.3,006699,1,,,,"Expurgate vetus fermentum ut sitis nova conspersio etenim pascha nostrum immolatus est Christus itaque epulemur in domino alleluia",,,,,CGBEMVHRDFSL,,,576376
"I-VCd LXIV",,007r,3,"Mortuus est propter delicta","Fer. 3 p. Pascha",M,V,01,006699b,1,,,,"Mortuus est propter delicta nostra et resurrexit propter justificationem nostram",,,,,SL,,,576377
"I-VCd LXIV",,007r,4,"Alleluia alleluia alleluia alleluia alleluia ","Fer. 3 p. Pascha",L,A,p,001333,8,,1,118a,"Alleluia alleluia alleluia alleluia alleluia alleluia alleluia alleluia",,,,,,,,576378
"I-VCd LXIV",,007v,1,"Stetit Jesus in medio discipulorum ","Fer. 3 p. Pascha",E,A,1,005032,8,,1,118a,"Stetit Jesus in medio discipulorum suorum et dixit eis pax vobis alleluia alleluia",,,,,CGBEMVHRDFSL,,,576379
"I-VCd LXIV",,007v,2,"Videte manus meas et pedes ","Fer. 3 p. Pascha",E,A,2,005400,8,,1,118a,"Videte manus meas et pedes meos quia ego ipse sum alleluia alleluia",,,,,CGBEMVHRDFSL,,,576380
"I-VCd LXIV",,007v,3,"Spiritus carnem et ossa non ","Fer. 3 p. Pascha",E,A,3,004996,8,,1,118a,"Spiritus carnem et ossa non habet sicut me videtis habere jam credite alleluia",,,,,"CG E  HRDFSL",,,576381
"I-VCd LXIV",,007v,4,"Obtulerunt discipuli domino partem piscis ","Fer. 3 p. Pascha",E,A,4,004103,1,,2,66d,"Obtulerunt discipuli domino partem piscis assi et favum mellis alleluia alleluia",,,,,"CG E VHRDFSL",,,576382
"I-VCd LXIV",,008r,1,"Ecce vicit leo de tribu Juda","Fer. 4 p. Pascha",M,R,1.1,006616,7,,,,"Ecce vicit leo de tribu Juda radix David aperire librum et solvere septem signacula ejus alleluia alleluia alleluia",,,,,"CGBE VHRDFSL",,,576383
"I-VCd LXIV",,008r,2,"Et unus de senioribus dixit","Fer. 4 p. Pascha",M,V,01,006616a,7,,,,"Et unus de senioribus dixit mihi ne fleveris dignus est agnus qui occisus est accipere potestatem et fortitudinem",,,,,"CGBE VHRDFS",,,576384
"I-VCd LXIV",,008r,3,"Isti sunt agni novelli qui","Fer. 4 p. Pascha",M,R,1.2,007012,7,,,,"Isti sunt agni novelli qui annuntiaverunt alleluia modo venerunt ad fontes repleti sunt claritate alleluia alleluia",,,,,"CGBE VHRDFSL",,,576385
"I-VCd LXIV",,008r,4,"In conspectu agni amicti","Fer. 4 p. Pascha",M,V,01,007012a,7,,,,"In conspectu agni amicti stolis albis et palmae in manibus eorum",,,,,"G      DFSL",,,576386
"I-VCd LXIV",,008v,1,"De ore prudentis procedit mel","Fer. 4 p. Pascha",M,R,1.3,006396,7,,,,"De ore prudentis procedit mel alleluia dulcedo mellis est lingua ejus alleluia favus distillans labia ejus alleluia alleluia",,,,,"CGBE VHRDFSL",,,576387
"I-VCd LXIV",,008v,2,"Sapientia requiescit in corde","Fer. 4 p. Pascha",M,V,01,006396b,7,,,,"Sapientia requiescit in corde ejus et prudentia in sermone oris illius",,,,,"D SL",,,576388
"I-VCd LXIV",,008v,3,"Mittite in dexteram navigii rete ","Fer. 4 p. Pascha",E,A,1,003800,7,,1,144a,"Mittite in dexteram navigii rete et invenietis alleluia",,,,,"CGBE VHRDFSL",,,576389
"I-VCd LXIV",,008v,4,"Dixit Jesus discipulis suis afferte ","Fer. 4 p. Pascha",E,A,2,002296,8,,1,118a,"Dixit Jesus discipulis suis afferte de piscibus quos prendidistis nunc ascendit autem Simon Petrus et traxit rete in terram plenum magnis piscibus alleluia",,,,,"CGBE VHR FSL",,,576390
"I-VCd LXIV",,009r,1,"Hoc jam tertio manifestavit se ","Fer. 4 p. Pascha",E,A,3,003085,7,,1,144a,"Hoc jam tertio manifestavit se Jesus postquam resurrexit a mortuis alleluia",,,,,"CG E  H  FSL",,,576391
"I-VCd LXIV",,009r,2,"Et recordati sunt verborum ejus ","Fer. 4 p. Pascha",E,A,4,002717,8,,1,118a,"Et recordati sunt verborum ejus et regressae ad monumentum nuntiaverunt haec omnia illis undecim et ceteris omnibus alleluia",,,,,"CG EM HRDF L",,,576392
"I-VCd LXIV",,009v,1,"Maria Magdalenae*","Fer. 5 p. Pascha",M,R,1.1,007128,8,,,,"Maria Magdalenae*",,,,,CGBEMVHRDFSL,,,576393
"I-VCd LXIV",,009v,2,"Cito euntes*","Fer. 5 p. Pascha",M,V,01,007128a,8,,,,"Cito euntes*",,,,,CGBEMVHRDFS,,,576394
"I-VCd LXIV",,009v,3,"Surgens Jesus*","Fer. 5 p. Pascha",M,R,1.2,007734,7,,,,"Surgens Jesus*",,,,,CGBEMVHRDFSL,,,576395
"I-VCd LXIV",,009v,4,"Una ergo*","Fer. 5 p. Pascha",M,V,01,007734b,7,,,,"Una ergo*",,,,,"F L",,,576396
"I-VCd LXIV",,009v,5,Congratulamini*,"Fer. 5 p. Pascha",M,R,1.3,006323,3,,,,Congratulamini*,,,,,CGBEMVHRDFSL,,,576397
"I-VCd LXIV",,009v,6,Recedentibus*,"Fer. 5 p. Pascha",M,V,01,006323b,3,,,,Recedentibus*,,,,,DFSL,,,576398
"I-VCd LXIV",,009v,7,"Alleluia vi","Fer. 5 p. Pascha",L,A,p,001331,8T,,*,,"Alleluia alleluia alleluia alleluia alleluia alleluia",,,,,,,,576399
"I-VCd LXIV",,009v,8,"Maria stans ad monumentum plorans ","Fer. 5 p. Pascha",E,A,1,003705,7,,3,143b,"Maria stans ad monumentum plorans vidit angelum in albis sedentem et sudarium quod fuerat super caput Jesu alleluia",,,,,"CGBE VHRDFSL",,,576400
"I-VCd LXIV",,009v,9,"Dixit Jesus mulier quid ploras ","Fer. 5 p. Pascha",E,A,2,002300,1,,2,66d,"Dixit Jesus mulier quid ploras quem quaeris illa autem dixit tulerunt dominum meum et nescio ubi posuerunt eum alleluia alleluia",,,,,"V R",,,576401
"I-VCd LXIV",,010r,1,"Tulerunt dominum meum et nescio ","Fer. 5 p. Pascha",E,A,3,005232,7,,2,142a,"Tulerunt dominum meum et nescio ubi posuerunt eum si tu sustulisti eum dicito mihi alleluia et ego eum tollam alleluia",,,,,"CG E  HRDFSL",,,576402
"I-VCd LXIV",,010r,2,"Venit Maria nuntians discipulis quia ","Fer. 5 p. Pascha",E,A,4,005346,7,,3,143b,"Venit Maria nuntians discipulis quia vidit dominum alleluia alleluia",,,,,"C BE VHRDFSL",,,576403
"I-VCd LXIV",,010r,3,"Virtute magna*","Fer. 6 p. Pascha",M,R,1.1,007907,3*,,,,"Virtute magna*",,,,,CGBEMVHRDFSL,,,576404
"I-VCd LXIV",,010r,4,"Repleti quidem*","Fer. 6 p. Pascha",M,V,01,007907b,3*,,,,"Repleti quidem*",,,,,"G      DFSL",,,576405
"I-VCd LXIV",,010r,5,Tulerunt*,"Fer. 6 p. Pascha",M,R,1.2,007797,8*,,,,Tulerunt*,,,,,CGBEMVHRDFSL,,,576406
"I-VCd LXIV",,010r,6,"Cito euntes*","Fer. 6 p. Pascha",M,V,01,007797a,*,,,,"Cito euntes*",,,,,CGBEMVHR,,,576407
"I-VCd LXIV",,010r,7,Expurgate*,"Fer. 6 p. Pascha",M,R,1.3,006699,1*,,,,Expurgate*,,,,,CGBEMVHRDFSL,,,576408
"I-VCd LXIV",,010r,8,"Mortuus est*","Fer. 6 p. Pascha",M,V,01,006699b,1*,,,,"Mortuus est*",,,,,SL,,,576409
"I-VCd LXIV",,010v,1,"Alleluia alleluia alleluia alleluia alleluia ","Fer. 6 p. Pascha",L,A,p,001331,8,,1,118a,"Alleluia alleluia alleluia alleluia alleluia alleluia",,,,,,,,576410
"I-VCd LXIV",,010v,2,"Undecim discipuli in Galilaeam videntes ","Fer. 6 p. Pascha",E,A,1,005271,7,,1,144a,"Undecim discipuli in Galilaeam videntes dominum adoraverunt alleluia",,,,,"CGBE VHRDFSL",,,576411
"I-VCd LXIV",,010v,3,"Data est mihi omnis potestas ","Fer. 6 p. Pascha",E,A,2,002099,8,,1,118a,"Data est mihi omnis potestas in caelo et in terra alleluia",,,,,"CGBE VHRDFSL",,,576412
"I-VCd LXIV",,010v,4,"Ecce ego vobiscum sum alleluia ","Fer. 6 p. Pascha",E,A,3,002513,6,,1,7a,"Ecce ego vobiscum sum alleluia omnibus diebus alleluia",,,,,"C  E VHRDF L",,,576413
"I-VCd LXIV",,010v,5,"Gavisi sunt discipuli alleluia viso ","Fer. 6 p. Pascha",E,A,4,002934,6,,1,7a,"Gavisi sunt discipuli alleluia viso domino alleluia",,,,,"CG   VHR F L",,,576414
"I-VCd LXIV",,011r,1,"Ecce vincit leo*","Sabbato in Albis",M,R,1.1,006616,7*,,,,"Ecce vincit leo*",,,,,"CGBE VHRDFSL",,,576415
"I-VCd LXIV",,011r,2,"Et unus*","Sabbato in Albis",M,V,01,006616a,7*,,,,"Et unus*",,,,,"CGBE VHRDFS",,,576416
"I-VCd LXIV",,011r,3,"Isti sunt agni*","Sabbato in Albis",M,R,1.2,007012,7*,,,,"Isti sunt agni*",,,,,"CGBE VHRDFSL",,,576417
"I-VCd LXIV",,011r,4,"In conspectu*","Sabbato in Albis",M,V,01,007012a,7*,,,,"In conspectu*",,,,,"G      DFSL",,,576418
"I-VCd LXIV",,011r,5,"De ore prudentis*","Sabbato in Albis",M,R,1.3,006396,7*,,,,"De ore prudentis*",,,,,"CGBE VHRDFSL",,,576419
"I-VCd LXIV",,011r,6,Sapientia*,"Sabbato in Albis",M,V,01,006396b,7*,,,,Sapientia*,,,,,"D SL",,,576420
"I-VCd LXIV",,011r,7,"Currebant duo simul et ille ","Sabbato in Albis",L,A,B,002081,1,,1,69b,"Currebant duo simul et ille alius discipulus praecucurrit citius Petro et venit prior ad monumentum alleluia",,,,,"CGBE VHRDFSL",,,576421
"I-VCd LXIV",,011r,8,"Surgens autem mane prima sabbati ","Sabbato in Albis",L,A,P,005075,8,,1,118a,"Surgens autem mane prima sabbati apparuit primo Mariae Magdalenae de qua eiecerat septem daemonia alleluia alleluia alleluia",,,,,"CGBEM HRDF L",,,576422
"I-VCd LXIV",,011v,1,"Surrexit dominus de sepulcro","Sabbato in Albis",P,A,,005079,8,,*,,"Surrexit dominus de sepulcro qui pro nobis pependit in ligno alleluia",,,,,"C BE  HRDFSL",,,576423
"I-VCd LXIV",,011v,2,"Noli flere Maria alleluia","Sabbato in Albis",T,A,,206253,5,,*,,"Noli flere Maria alleluia resurrexit dominus alleluia",,,,,,,,576424
"I-VCd LXIV",,011v,3,"Resurrexit dominus alleluia","Sabbato in Albis",T,R,,007540,r,,,,"Resurrexit dominus alleluia alleluia",,,,,"E V",,,576425
"I-VCd LXIV",,011v,4,"Sicut dixit vobis alleluia","Sabbato in Albis",T,V,01,007540a,r,,,,"Sicut dixit vobis alleluia alleluia",,,,,"E V",,,576426
"I-VCd LXIV",,011v,5,"Surrexit dominus vere","Sabbato in Albis",T,W,,008213,r,,,,"Surrexit dominus vere",,,,,"C BEMVHR  SL",,,576427
"I-VCd LXIV",,011v,6,"Pax vobis ego sum alleluia","Sabbato in Albis",S,A,,004254,6,,*,,"Pax vobis ego sum alleluia nolite timere alleluia",,,,,"CGBE  HRDF L",,,576428
"I-VCd LXIV",,011v,7,"Surrexit dominus vere","Sabbato in Albis",S,R,,007740,r,,,,"Surrexit dominus vere alleluia alleluia",,,,,"E VH   S",,,576429
"I-VCd LXIV",,011v,8,"Et apparuit Simoni alleluia","Sabbato in Albis",S,V,01,007740a,r,,,,"Et apparuit Simoni alleluia alleluia",,,,,"E VH   S",,,576430
"I-VCd LXIV",,011v,9,"Gavisi sunt*","Sabbato in Albis",S,W,,008080,r,,,,"Gavisi sunt*",,,,,"C BE VHR  S",,,576431
"I-VCd LXIV",,012r,1,"Ecce ego vobiscum sum","Sabbato in Albis",N,A,,002513,6,,*,,"Ecce ego vobiscum sum alleluia omnibus diebus alleluia",,,,,"C  E VHRDF L",,,576432
"I-VCd LXIV",,012r,2,"Gavisi sunt discipuli","Sabbato in Albis",N,R,,006767,r,,,,"Gavisi sunt discipuli alleluia alleluia",,,,,"H D",,,576433
"I-VCd LXIV",,012r,3,"Viso domino alleluia","Sabbato in Albis",N,V,01,006767a,r,,,,"Viso domino alleluia alleluia",,,,,"H D",,,576434
"I-VCd LXIV",,012r,4,"Noli flere Maria","Sabbato in Albis",N,W,,008149,r,,,,"Noli flere Maria",,,,,"C B  V RD",,,576435
"I-VCd LXIV",,012r,5,"Maria Magdalenae et Maria Jacobi ","Sabbato in Albis",V2,A,M,206019,7,,3,143b,"Maria Magdalenae et Maria Jacobi et Salome sabbato quidem siluerunt secundum mandatum alleluia cum autem transisset sabbatum ementes aromata venerunt ungere Jesum alleluia alleluia alleluia",,,,,,,,576436
"I-VCd LXIV",,012v,1,"Propter lignum servi facti sumus ","Sabbato in Albis",V2,A,P,004398,8,,1,118a,"Propter lignum servi facti sumus et per sanctam crucem liberati sumus fructus arboris seduxit nos filius dei redemit nos alleluia",,,,,EM,,,576437
"I-VCd LXIV",,012v,2,"Alleluia iii","Octava Paschae",M,I,,001023,7*,,,,"Alleluia alleluia alleluia",,,,,"CGBEMVHRD S",,,576438
"I-VCd LXIV",,012v,3,"Ego sum qui sum*","Octava Paschae",M,A,1.1,002599,2*,,*,,"Ego sum qui sum*",,,,,CGBEMVHRDFSL,,,576439
"I-VCd LXIV",,012v,4,Postulavi*,"Octava Paschae",M,A,1.2,004342,1*,,*,,Postulavi*,,,,,CGBEMVHRDFSL,,,576440
"I-VCd LXIV",,012v,5,"Ego dormivi*","Octava Paschae",M,A,1.3,002572,8*,,*,,"Ego dormivi*",,,,,CGBEMVHRDFSL,,,576441
"I-VCd LXIV",,012v,6,"Resurrexit dominus","Octava Paschae",M,W,1.,008185,*,,,,"Resurrexit dominus",,,,,"CG EMV R  S",,,576442
"I-VCd LXIV",,012v,7,"Alleluia alleluia alleluia alleluia alleluia ","Octava Paschae",L,A,p,001331,8,,3,99d,"Alleluia alleluia alleluia alleluia alleluia alleluia",,,,,,,,576443
"I-VCd LXIV",,013r,1,"Post dies octo januis clausis ","Octava Paschae",E,A,1,004326,8,,3,99d,"Post dies octo januis clausis ingressus dominus et dixit eis pax vobis alleluia alleluia",,,,,CGBEMVHRDFSL,,,576444
"I-VCd LXIV",,013r,2,"Mitte manum tuam et cognosce ","Octava Paschae",E,A,2,003797,8,,4,120a,"Mitte manum tuam et cognosce loca clavorum alleluia et noli esse incredulus sed fidelis alleluia",,,,,CGBEMVHRDFSL,,,576445
"I-VCd LXIV",,013r,3,"Misi digitos meos in fixuram ","Octava Paschae",E,A,3,003782,8,,4,120a,"Misi digitos meos in fixuram clavorum et manus meas in latus ejus et dixi dominus meus et deus meus alleluia",,,,,"C BE  HR   L",,,576446
"I-VCd LXIV",,013r,4,"Quia vidisti me Thoma credidisti ","Octava Paschae",E,A,4,004513,8,,4,120a,"Quia vidisti me Thoma credidisti beati qui non viderunt et crediderunt alleluia",,,,,CGBEMVHRDFSL,,,576447
"I-VCd LXIV",,013v,1,"Multa quidem et alia signa ","Octava Paschae",E,A,5,003828,3,,5,101b,"Multa quidem et alia signa fecit Jesus in conspectu discipulorum suorum alleluia quae non sunt scripta in libro hoc alleluia",,,,,"CGBEMVHR FSL",,,576448
"I-VCd LXIV",,013v,2,"Haec autem scripta sunt ut ","Octava Paschae",E,A,6,002993,8,,1,118a,"Haec autem scripta sunt ut credatis quia Jesus est Christus filius dei et ut credentes vitam habeatis in nomine ipsius alleluia",,,,,"CGBEM HRDFSL",,,576449
"I-VCd LXIV",,013v,3,"Resurrexit dominus","In tempore Paschae",M,W,1,008185,*,,,,"Resurrexit dominus",,,,,"CG EMV R  S",,,576450
"I-VCd LXIV",,013v,4,"Surrexit dominus vere","In tempore Paschae",M,W,2,008213,*,,,,"Surrexit dominus vere",,,,,"C BEMVHR  SL",,,576451
"I-VCd LXIV",,013v,5,"Surrexit dominus de sepulcro","In tempore Paschae",M,W,3,008212,*,,,,"Surrexit dominus de sepulcro",,,,,"C  EMVHRD SL",,,576452
"I-VCd LXIV",,013v,6,"Gavisi sunt*","In tempore Paschae",M,W,4,008080,*,,,,"Gavisi sunt*",,,,,"C BE VHR  S",,,576453
"I-VCd LXIV",,013v,7,"In resurrectione tua Christe","In tempore Paschae",M,W,5,008100,*,,,,"In resurrectione tua Christe",,,,,"C BEMVHRD",,,576454
"I-VCd LXIV",,013v,8,"Alleluia alleluia alleluia alleluia alleluia ","Fer. 2 p. Oct.Pasch.",L,A,p,001332,8,,1,118a,"Alleluia alleluia alleluia alleluia alleluia alleluia alleluia",,,,,,,,576455
"I-VCd LXIV",,014r,1,"Surgens Jesus mane*","Fer. 2 p. Oct.Pasch.",L,A,B,005075,8*,,*,,"Surgens Jesus mane*",,,,,"CGBEM HRDF L",,,576456
"I-VCd LXIV",,014r,2,"Crucifixus surrexit tertia die de ","Fer. 2 p. Oct.Pasch.",L,A,P,001958,8,,1,118a,"Crucifixus surrexit tertia die de sepulcro alleluia alleluia",,,,,V,,,576457
"I-VCd LXIV",,014r,3,"Venite omnes adoremus eum qui ","Fer. 2 p. Oct.Pasch.",V2,A,P,005353,4,,5,19g,"Venite omnes adoremus eum qui de morte resurrexit ideo venit per crucem gaudium in orbem terrae alleluia alleluia",,,,,"E V     L",,,576458
"I-VCd LXIV",,014r,4,"Alleluia alleluia alleluia alleluia alleluia ","Fer. 3 p. Oct.Pasch.",L,A,p,001332,2,,1,150e,"Alleluia alleluia alleluia alleluia alleluia alleluia alleluia",,,,,,,,576459